Discussions
Categories
Groups
Community Home
Categories
INTERNAL ENABLEMENT
POPULAR
PUBLIC CLOUD
PRIVATE CLOUD
Quick Links
MY LINKS
HELPFUL TIPS
Back to website
Home
Web CMS (TeamSite)
Installing LiveSite 3.0.2.0 - No OpenDeploy Detected Error
Raymand
Hi,
I am trying to install LiveSite 3.0.2.0 on existing Teamsite environment . The installer is able to detect my Teamsite Environment ( iwserver: 6.7.1 Build 67998 Interwoven 20070828) and unable to Detect my OpenDeploy Base Server(Version 6.2.0.0.0 Build 68916 Interwoven 20071109).
I installed OpenDeploy Admin Server also and all Teamsite Services and OpenDeploy Services are running
C:\iw-home\OpenDeployNG\bin>iwodserverstatus
OpenDeploy server host: localhost, RMI registry port: 9173
OpenDeploy server is alive.
0 deployments are currently active.
2) I also configured odbase.xml for webservices, databasedeployments and did OD stop/start.
Attaching odbase.xml for better understanding.
OS: windows 2003
Looking forward your help
Thanks!
Find more posts tagged with
Comments
msrinivas
LS 3.0.2 can be installed with OD 6.1.1 only. So uninstall OD 6.2. Install OD 6.1.1. Then install LS 3.0.2 and then upgrade OD to 6.2.
Went through this pain last week :mad:
Raymand
Hi Srinivas,
Thanks for your response. I got errors during installation, Here are the details
Hi,
I installed "LiveSite 3.0.2.0" (Site Publisher) on
Windows 2003 Server Service Pack 1
TeamSite 6.7.1. Sp1
OpenDeploy 6.1.1 with patch 1816
During installtion I got some error messages. Below are the error messages.
Once installation completed, I did system restart . I am unable to login to TeamSite UI from then onwards. Login screen is not coming.
ERROR Msg in login screen
--------------------------------------------------------------------
HTTP Status 404 - /iw-cc/command/iw.ccpro.filesys
--------------------------------------------------------------------------------
type Status report
message /iw-cc/command/iw.ccpro.filesys
description The requested resource (/iw-cc/command/iw.ccpro.filesys) is not available.
------------------------------------------------------------------------
LiveSite installation Errors:
------------------------------------------------------------------------
C:\Documents and Settings\Administrator\Local Settings\Temp\I1205238744\Windows>set LS_HOME=C:\iw-home\LiveSite
C:\Documents and Settings\Administrator\Local Settings\Temp\I1205238744\Windows>set JAVA_HOME="C:\iw-home\tools\java"
C:\Documents and Settings\Administrator\Local Settings\Temp\I1205238744\Windows>"C:\iw-home\tools\ant\bin\ant" -f "C:\iw-home\install\livesite\post-install-webapp-livesite.xml" build.xml.munge.postinstall
JAVA_HOME=C:\iw-home\tools\java
Buildfile: C:\iw-home\install\livesite\post-install-webapp-livesite.xml
Overriding previous definition of reference to classpath.postinstall
init:
[echo]
[echo] TeamSite Installation Directory: C:\iw-home
[echo] TeamSite Temp Directory: C:\iw-home/tmp
[echo] TeamSite Mount Path: Y:
[echo] TeamSite Email Server: 127.0.0.1.entology.com
[echo] TeamSite iw.cfg Path: C:\iw-home/etc/iw.cfg
[echo]
[echo] LiveSite Customer Toolkit: C:\iw-home/local/config/lib/content_center/livesite_customer_src
[echo]
build.xml.munge.postinstall:
[referencebuildxmlmunger] operation: munge
[referencebuildxmlmunger] build.xml file: C:\iw-home\local\config\lib\content_center\reference\bui ld.xml...
[exec] Result: 1
BUILD FAILED
java.lang.NoClassDefFoundError: org/saxpath/SAXPathException
Total time: 3 seconds
-----------------------------------------------------------------------------------------------------------
C:\Documents and Settings\Administrator\Local Settings\Temp\I1205238744\Windows>set LS_HOME=C:\iw-home\LiveSite
C:\Documents and Settings\Administrator\Local Settings\Temp\I1205238744\Windows>cd "C:\iw-home\local\config\lib\content_center\livesite_cust omer_src" && "C:\iw-home\local\config\lib\content_center\livesite_cust omer_src\build.bat" build
JAVA_HOME=C:\iw-home\tools\java
Buildfile: build.xml
[echo]
[echo] Build Root: C:/iw-home/local/config/lib/content_center/livesite_customer_src
[echo] TeamSite Installation Directory: C:\iw-home
[echo] TeamSite Temp Directory: C:\iw-home/tmp
[echo] TeamSite Mount Path: Y:
[echo]
Overriding previous definition of reference to _build.root.path
Overriding previous definition of reference to classpath.postinstall
assert.dirs:
[mkdir] Created dir: C:\iw-home\local\config\lib\content_center\livesite_cust omer_src\etc\conf\classes
make_toolkit_files:
[exec] JAVA_HOME=C:\iw-home\tools\java
[exec] Buildfile: C:\iw-home\local\config\lib\content_center\reference\bui ld.xml
[exec] BUILD FAILED
[exec] Target `iw-preview.update' does not exist in this project.
[exec] Total time: 0 seconds
configuration.jdbc.copy.postinstall:
[echo] Copying 2 JDBC driver archives to Preview and Runtime Administration contexts...
[copy] Copying 1 file to C:\iw-home\httpd\webapps\iw-preview\WEB-INF\lib
[copy] Copying 1 file to C:\iw-home\httpd\webapps\iw-rta\WEB-INF\lib
[copy] Copying 1 file to C:\iw-home\httpd\webapps\iw-preview\WEB-INF\lib
[copy] Copying 1 file to C:\iw-home\httpd\webapps\iw-rta\WEB-INF\lib
configuration.copy.postinstall:
[mkdir] Created dir: C:\iw-home\httpd\webapps\content_center\WEB-INF\conf\livesite_customer\orm
[copy] Copying 2 files to C:\iw-home\httpd\webapps\iw-preview\WEB-INF\conf\livesite_customer
[exec] Result: 1
[exec] Result: 1
BUILD FAILED
C:\iw-home\install\livesite\post-install-webapp-livesite.xml:314: C:\iw-home\local\config\lib\content_center\livesite_cust omer_out not found.
Total time: 4 seconds
C:\Documents and Settings\Administrator\Local Settings\Temp\I1205238744\Windows>C:\iw-home\LiveSite\install\install_webapps.bat -f -r
Stopping Interwoven UI services... done.
Removing webapp content_center... done.
Installing [ base.tk.war teamsite.tk.war vpreview.tk.war datacapture.tk.war ccpro.tk.war formspub.tk.war teamsite_admin.tk.war ccstd.tk.war workflowModeler.tk.war vannotate.tk.war transform.tk.war tagui.tk.war search.tk.war reporting.tk.war mtdialog.tk.war metadata.tk.war livesite.tk.war ecmconnector.tk.war customer.tk.war ] as webapp content_center...
Configuring JSPs... ... done.
Executing C:\iw-home/httpd/webapps/installinfo/workflowModeler.tk/WEB-INF/post-install_webapp.ipl
Executing C:\iw-home/httpd/webapps/installinfo/reporting.tk/WEB-INF/post-install_webapp.ipl
Copying C:\iw-home/private/lib/content_center/installer_config/reporting/reporting_config.xml to C:\iw-home/httpd/webapps/content_center/WEB-INF/conf/reporting
Executing C:\iw-home/httpd/webapps/installinfo/livesite.tk/WEB-INF/post-install_webapp.ipl
JAVA_HOME=C:\iw-home\tools\java
Buildfile: C:\iw-home\install\livesite\post-install-webapp-livesite.xml
Overriding previous definition of reference to classpath.postinstall
init:
[echo]
[echo] TeamSite Installation Directory: C:\iw-home
[echo] TeamSite Temp Directory: C:\iw-home/tmp
[echo] TeamSite Mount Path: Y:
[echo] TeamSite Email Server: 127.0.0.1.entology.com
[echo] TeamSite iw.cfg Path: C:\iw-home/etc/iw.cfg
[echo]
[echo] LiveSite Customer Toolkit: C:\iw-home/local/config/lib/content_center/livesite_customer_src
[echo]
server.xml.munge.postinstall:
[serverxmlmunger] operation: munge
[serverxmlmunger] server.xml file: C:\iw-home\servletd\conf\server.xml.template...
Warning: WEB-INF/webapp.ver is not found in iw-preview.war.
C:\iw-home/httpd/webapps/iw-preview.war will not
be installed on the system.
Please upgrade the product package in order to re-install iw-preview.war.
Removing webapp eventsubsystem... done.
Installing [ eventsubsystem.war ] as webapp eventsubsystem... Executing C:\iw-home/httpd/webapps/installinfo/eventsubsystem/WEB-INF/post-install_webapp.ipl
Usage: C:\iw-home\LiveSite\install\install_webapps.bat.bat [-h] [-i|-u] [-f] [-r] [-remove_work_files]
[-jsp_precompile | -nojsp_precompile ] webapp...
Installs, reinstalls, or uninstalls Interwoven webapps.
-i Install webapps (default)
-u Uninstall webapps
-f Force deletion of old webapps without prompting
-r Do not restart Interwoven services afterwards
-remove_work_files A pre action to remove any files
in servletd/work
-jsp_precompile When installing (-i), precompile
JSP pages
-nojsp_precompile When installing (-i), do not
precompile JSP pages
-h This message
log4j:WARN No appenders could be found for logger (org.apache.jasper.JspC).
log4j:WARN Please initialize the log4j system properly.
Note: Some input files use or override a deprecated API.
Note: Recompile with -Xlint:deprecation for details.
Note: Some input files use unchecked or unsafe operations.
Note: Recompile with -Xlint:unchecked for details.
[exec] Result: 1
BUILD FAILED
java.lang.NoClassDefFoundError: org/saxpath/SAXPathException
Total time: 3 seconds
Interwoven Servlet Engine failed to start.
Because the Servlet Engine is not accessible at this time, the installation program cannot complete the following post-install tasks:
C:\iw-home\LiveSite\livesite\init_post_install.bat
C:\iw-home\LiveSite\livesite\component_install.bat
C:\iw-home\LiveSite\livesite\iw_mount_install.bat
C:\iw-home\LiveSite\livesite\role_install.bat
Interwoven LiveSite 3.0.2.0 has been installed into:
C:\iw-home\LiveSite
The installation program will now exit.
The C:\iw-home\LiveSite\livesite\init_post_install.bat script produced the following error:
[echo]
[echo] TeamSite Installation Directory: C:\iw-home
[echo] TeamSite Temp Directory: C:\iw-home/tmp
[echo] TeamSite Mount Path: Y:
[echo]
[echo] Common Classpath:
[echo] C:\iw-home\httpd\webapps\content_center\WEB-INF\lib\base.jar;C:\iw-home\httpd\webapps\content_center\WEB-INF\lib\hopi.jar;C:\iw-home\httpd\webapps\content_center\WEB-INF\lib\serverutils100.jar;C:\iw-home\httpd\webapps\content_center\WEB-INF\lib\sharedutils100.jar;C:\iw-home\httpd\webapps\content_center\WEB-INF\lib\teamsite.jar;C:\iw-home\httpd\webapps\content_center\WEB-INF\lib\teamsite_admin.jar;C:\iw-home\httpd\webapps\content_center\WEB-INF\lib\utild_hopi.jar;C:\iw-home\cssdk\common100.jar;C:\iw-home\cssdk\cssdkiface.jar;C:\iw-home\cssdk\cssdkjni.jar;C:\iw-home\cssdk\oscache-2.2.jar;C:\iw-home\httpd\webapps\content_center\WEB-INF\lib\livesite-runtime.jar;C:\iw-home\httpd\webapps\content_center\WEB-INF\lib\livesite.jar;C:\iw-home\httpd\webapps\content_center\WEB-INF\conf\livesite;C:\iw-home\httpd\webapps\content_center\WEB-INF\classes;C:\iw-home\httpd\webapps\content_center\WEB-INF\lib\commons-collections-3.2.jar;C:\iw-home\httpd\webapps\content_center\WEB-INF\lib\commons-digester-1.8.jar;C:\iw-home\httpd\webapps\content_center\WEB-INF\lib\commons-lang-2.2.jar;C:\iw-home\httpd\webapps\content_center\WEB-INF\lib\commons-logging.jar;C:\iw-home\httpd\webapps\content_center\WEB-INF\lib\commons-pool-1.3.jar;C:\iw-home\httpd\webapps\content_center\WEB-INF\lib\dom4j-1.6.1.jar;C:\iw-home\httpd\webapps\content_center\WEB-INF\lib\jaxen-1.1.jar;C:\iw-home\httpd\webapps\content_center\WEB-INF\lib\log100.jar;C:\iw-home\httpd\webapps\content_center\WEB-INF\lib\log4j-1.2.13.jar;C:\iw-home\httpd\webapps\content_center\WEB-INF\lib\mail.jar;C:\iw-home\httpd\webapps\content_center\WEB-INF\lib\spring.jar;C:\iw-home\servletd\common\lib\servlet-api.jar
[echo]
execute.init.post.install:
[initpostinstall] 2008-03-11 08:56:02,328 ERROR com.interwoven.livesite.iw.impl.CSBackingStoreServ ice - Error while creating/updating branch: /iwadmin/main/livesite
[initpostinstall] com.interwoven.cssdk.common.CSException: livesite(Insufficient space to complete operation)
[initpostinstall] at com.interwoven.cssdk.filesys.jni.FileServiceAdapte rImpl.createSubBranch(Native Method)
[initpostinstall] at com.interwoven.cssdk.filesys.impl.CSBranchImpl.cre ateSubBranch(CSBranchImpl.java:436)
[initpostinstall] at com.interwoven.livesite.iw.impl.CSBackingStoreServ ice.createOrUpdateBranch(CSBackingStoreService.jav a:232)
[initpostinstall] at com.interwoven.livesite.iw.impl.CSBackingStoreServ ice.processServiceItem(CSBackingStoreService.java: 149)
[initpostinstall] at com.interwoven.livesite.iw.impl.CSBackingStoreServ ice.processServiceItems(CSBackingStoreService.java :110)
[initpostinstall] at com.interwoven.livesite.iw.impl.CSBackingStoreServ ice.initService(CSBackingStoreService.java:89)
[initpostinstall] at sun.reflect.NativeMethodAccessorImpl.invoke0(Nativ e Method)
[initpostinstall] at sun.reflect.NativeMethodAccessorImpl.invoke(Native MethodAccessorImpl.java:39)
[initpostinstall] at sun.reflect.DelegatingMethodAccessorImpl.invoke(De legatingMethodAccessorImpl.java:25)
[initpostinstall] at java.lang.reflect.Method.invoke(Method.java:585)
[initpostinstall] at org.springframework.beans.factory.support.Abstract AutowireCapableBeanFactory.invokeCustomInitMethod( AbstractAutowireCapableBeanFactory.java:1104)
[initpostinstall] at org.springframework.beans.factory.support.Abstract AutowireCapableBeanFactory.invokeInitMethods(Abstr actAutowireCapableBeanFactory.java:1066)
[initpostinstall] at org.springframework.beans.factory.support.Abstract AutowireCapableBeanFactory.initializeBean(Abstract AutowireCapableBeanFactory.java:1029)
[initpostinstall] at org.springframework.beans.factory.support.Abstract AutowireCapableBeanFactory.createBean(AbstractAuto wireCapableBeanFactory.java:420)
[initpostinstall] at org.springframework.beans.factory.support.Abstract BeanFactory$1.getObject(AbstractBeanFactory.java:2 45)
[initpostinstall] at org.springframework.beans.factory.support.DefaultS ingletonBeanRegistry.getSingleton(DefaultSingleton BeanRegistry.java:141)
[initpostinstall] at org.springframework.beans.factory.support.Abstract BeanFactory.getBean(AbstractBeanFactory.java:242)
[initpostinstall] at org.springframework.beans.factory.support.Abstract BeanFactory.getBean(AbstractBeanFactory.java:156)
[initpostinstall] at org.springframework.beans.factory.support.DefaultL istableBeanFactory.preInstantiateSingletons(Defaul tListableBeanFactory.java:290)
[initpostinstall] at org.springframework.context.support.AbstractApplic ationContext.refresh(AbstractApplicationContext.ja va:348)
[initpostinstall] at com.interwoven.livesite.spring.ApplicationContextU tils.createApplicationContext(ApplicationContextUt ils.java:102)
[initpostinstall] at com.interwoven.livesite.spring.ApplicationContextU tils.createApplicationContext(ApplicationContextUt ils.java:58)
[initpostinstall] at com.interwoven.livesite.iw.servlet.LiveSiteContext .init(LiveSiteContext.java:646)
[initpostinstall] at com.interwoven.livesite.tools.InitTask.execute(Ini tTask.java:71)
[initpostinstall] at org.apache.tools.ant.UnknownElement.execute(Unknow nElement.java:275)
[initpostinstall] at org.apache.tools.ant.Task.perform(Task.java:364)
[initpostinstall] at org.apache.tools.ant.Target.execute(Target.java:34 1)
[initpostinstall] at org.apache.tools.ant.Target.performTasks(Target.ja va:369)
[initpostinstall] at org.apache.tools.ant.Project.executeSortedTargets( Project.java:1216)
[initpostinstall] at org.apache.tools.ant.Project.executeTarget(Project .java:1185)
[initpostinstall] at org.apache.tools.ant.helper.DefaultExecutor.execut eTargets(DefaultExecutor.java:40)
[initpostinstall] at org.apache.tools.ant.Project.executeTargets(Projec t.java:1068)
[initpostinstall] at org.apache.tools.ant.Main.runBuild(Main.java:668)
[initpostinstall] at org.apache.tools.ant.Main.startAnt(Main.java:187)
[initpostinstall] at org.apache.tools.ant.launch.Launcher.run(Launcher. java:246)
[initpostinstall] at org.apache.tools.ant.launch.Launcher.main(Launcher .java:67)
BUILD FAILED
C:\iw-home\LiveSite\livesite\init_post_install.xml:43: org.springframework.beans.factory.BeanCreationExce ption: Error creating bean with name 'teamsite.BackingStoreService' defined in URL [file:C:/iw-home/LiveSite/livesite/teamsite-resource-config.xml]: Invocation of init method failed; nested exception is java.lang.RuntimeException: Error while creating/updating branch: /iwadmin/main/livesite
Total time: 6 seconds
Contact Interwoven Customer Support for assistance with this problem.
The remaining post-install tasks to run are:
C:\iw-home\LiveSite\livesite\init_post_install.bat
C:\iw-home\LiveSite\livesite\component_install.bat
C:\iw-home\LiveSite\livesite\iw_mount_install.bat
C:\iw-home\LiveSite\livesite\role_install.bat
Interwoven LiveSite 3.0.2.0 has been installed into:
C:\iw-home\LiveSite
The installation program will now exit.
--------------------------------------------------------------------------
Looking forward your help
Thanks !
tec_iwov
you should contact support for better assistance.
Aryan
Does LiveSite (Site Publisher) mandatorily require CSF to be setup before the installation starts?